Ocena wątku:
  • 0 głosów - średnia: 0
  • 1
  • 2
  • 3
  • 4
  • 5
Solved Brak wifi linux mint 19.2 Cinnamon
#21
0
Kod:
angelsagiri@AngelSagiri:~$ sudo apt-get install linux-headers-generic build-essential
[sudo] password for angelsagiri:       
Sorry, try again.
[sudo] password for angelsagiri:       
Czytanie list pakietów... Gotowe
Budowanie drzewa zależności     
Odczyt informacji o stanie... Gotowe
build-essential is already the newest version (12.4ubuntu1).
linux-headers-generic is already the newest version (4.15.0.62.64).
0 aktualizowanych, 0 nowo instalowanych, 0 usuwanych i 246 nieaktualizowanych.
#22
0
Ok, może się uda.. zacznij od cd... i tak dalej jedna po drugiej.
Mint 18.3 Cinnamon, kern. 4.10; 64-bit na: Lenovo G500S z CPU Pent. 2020M 2.4 GHz*2; 6 GB RAM; GPU Intel+GeForce 720M; LU#586742
#23
0
Kod:
angelsagiri@AngelSagiri:~$ cd MT7630E/rt2x00
angelsagiri@AngelSagiri:~/MT7630E/rt2x00$ make
make -C /lib/modules/4.18.0-041800-generic/build M=/home/angelsagiri/MT7630E/rt2x00 modules
make[1]: Entering directory '/usr/src/linux-headers-4.18.0-041800-generic'
suMakefile:938: "Cannot use CONFIG_STACK_VALIDATION=y, please install libelf-dev, libelf-devel or elfutils-libelf-devel"
d  CC [M]  /home/angelsagiri/MT7630E/rt2x00/rt2x00dev.o
o m/home/angelsagiri/MT7630E/rt2x00/rt2x00dev.c: In function ‘rt2x00lib_rxdone’:
/home/angelsagiri/MT7630E/rt2x00/rt2x00dev.c:792:19: error: ‘RX_FLAG_HT’ undeclared (first use in this function); did you mean ‘RX_ENC_HT’?
   rxdesc.flags |= RX_FLAG_HT;
                   ^~~~~~~~~~
                   RX_ENC_HT
/home/angelsagiri/MT7630E/rt2x00/rt2x00dev.c:792:19: note: each undeclared identifier is reported only once for each function it appears in
ascripts/Makefile.build:317: recipe for target '/home/angelsagiri/MT7630E/rt2x00/rt2x00dev.o' failed
make[2]: *** [/home/angelsagiri/MT7630E/rt2x00/rt2x00dev.o] Error 1
Makefile:1500: recipe for target '_module_/home/angelsagiri/MT7630E/rt2x00' failed
make[1]: *** [_module_/home/angelsagiri/MT7630E/rt2x00] Error 2
make[1]: Leaving directory '/usr/src/linux-headers-4.18.0-041800-generic'
Makefile:22: recipe for target 'all' failed
make: *** [all] Error 2
angelsagiri@AngelSagiri:~/MT7630E/rt2x00$ sudo make install
[sudo] password for angelsagiri:        
make: *** No rule to make target 'install'.  Stop.
angelsagiri@AngelSagiri:~/MT7630E/rt2x00$ sudo modprobe mt7630e
modprobe: FATAL: Module mt7630e not found in directory /lib/modules/4.18.0-041800-generic
angelsagiri@AngelSagiri:~/MT7630E/rt2x00$

Dodano po pewnym czasie:
Same problemy xD

Dodano po pewnym czasie:
Co o tym myślicie?
#24
0
Ostatnie na dziś próba. Spróbuj tak:
Kod:
git clone https://github.com/neurobin/MT7630E.git
cd MT7630E/rt2x00/
make
sudo make install
sudo modprobe mt7630e
każda linijka to osobna komenda. Wykonujesz kolejne po zakończeniu wykonania poprzedniej.

Na dziś więcej nie wymyśle... jakby coś, to wrócimy do tego jutro wieczorem.

EDIT - poprawiłem ścieżkę... sorry, padnięty już jestem.
Mint 18.3 Cinnamon, kern. 4.10; 64-bit na: Lenovo G500S z CPU Pent. 2020M 2.4 GHz*2; 6 GB RAM; GPU Intel+GeForce 720M; LU#586742
#25
0
dobra coś się dzieje

Dodano po pewnym czasie:
DZIAŁA

Dodano po pewnym czasie:
JEZU PO 6 godzinach, ale działa

Dodano po pewnym czasie:
Dzięki ci Ty nwm jak tam masz, ale dzięki ci

Dodano po pewnym czasie:
Jak ci dać rep czy cuś
#26
0
OK- ostatnie słowo... nie aktualizuj jądra więcej (nie ma takiej potrzeby), bo wywali to sterownik w kosmos i będzie zabawa od nowa Smile

Zamykam wątek i daje SOLVED.
Mint 18.3 Cinnamon, kern. 4.10; 64-bit na: Lenovo G500S z CPU Pent. 2020M 2.4 GHz*2; 6 GB RAM; GPU Intel+GeForce 720M; LU#586742


Skocz do:




Użytkownicy przeglądający ten wątek: 2 gości